{"text_format":"1","workbook":"xlsx","n_sheets":4,"sheets":["Lists","Price schedule","List of costs","Notes"],"not_rendered":{"charts":0,"images":2,"macros":1,"external_links":0,"defined_names":25,"comments":1,"pivot_tables":0},"unopened":[],"bounds":{"document_bytes":16777216,"sheet_cells":100000,"rows_first":2000,"rows_last":500,"rows_between":2000,"halvings":0,"cell_chars":16384,"cell_head_chars":4096},"cells_cut":0,"cells_raw":0,"read":"whole","date_system":"1900"}

{"sheet":"Lists","index":0,"n_rows":51,"n_cols":4,"rows_kept":51,"cut":false,"hidden":true,"merged":[]}
["Selection lists"]
[]
["Date",null,null,"Months"]
[{"$f":"IF(ISNUMBER('List of costs'!AF4),'List of costs'!AF4,TODAY())","v":44874},1,{"$f":"DATE(YEAR($A$4)+1,1-$B4,1)","v":"2022-12-01"},{"$f":"C4","v":"2022-12-01"}]
[null,2,{"$f":"DATE(YEAR($A$4)+1,1-$B5,1)","v":"2022-11-01"},"2022-11-01"]
[null,3,"2022-10-01","2022-10-01"]
[null,4,"2022-09-01","2022-09-01"]
[null,5,"2022-08-01","2022-08-01"]
[null,6,"2022-07-01","2022-07-01"]
[null,7,"2022-06-01","2022-06-01"]
[null,8,"2022-05-01","2022-05-01"]
[null,9,"2022-04-01","2022-04-01"]
[null,10,"2022-03-01","2022-03-01"]
[null,11,"2022-02-01","2022-02-01"]
[null,12,"2022-01-01","2022-01-01"]
[null,13,"2021-12-01","2021-12-01"]
[null,14,"2021-11-01","2021-11-01"]
[null,15,"2021-10-01","2021-10-01"]
[null,16,"2021-09-01","2021-09-01"]
[null,17,"2021-08-01","2021-08-01"]
[null,18,"2021-07-01","2021-07-01"]
[null,19,"2021-06-01","2021-06-01"]
[null,20,"2021-05-01","2021-05-01"]
[null,21,"2021-04-01","2021-04-01"]
[null,22,"2021-03-01","2021-03-01"]
[null,23,"2021-02-01","2021-02-01"]
[null,24,"2021-01-01","2021-01-01"]
[null,25,"2020-12-01","2020-12-01"]
[null,26,"2020-11-01","2020-11-01"]
[null,27,"2020-10-01","2020-10-01"]
[null,28,"2020-09-01","2020-09-01"]
[null,29,"2020-08-01","2020-08-01"]
[null,30,"2020-07-01","2020-07-01"]
[null,31,"2020-06-01","2020-06-01"]
[null,32,"2020-05-01","2020-05-01"]
[null,33,"2020-04-01","2020-04-01"]
[null,34,"2020-03-01","2020-03-01"]
[null,35,"2020-02-01","2020-02-01"]
[null,36,"2020-01-01","2020-01-01"]
[null,37,"2019-12-01","2019-12-01"]
{"$rows_left_out":12}
{"sheet":"Price schedule","index":1,"n_rows":109,"n_cols":20,"rows_kept":109,"cut":false,"hidden":false,"merged":[[107,1,107,4],[107,8,107,12],[43,1,43,12],[46,2,46,4],[74,2,74,4],[76,2,76,4],[94,2,94,7],[95,2,95,7],[67,2,67,4],[86,2,86,7],[93,2,93,7],[92,2,92,7],[91,2,91,7],[78,2,78,4],[85,2,85,7],[72,2,72,4],[33,2,33,4],[35,2,35,4],[37,2,37,4],[66,2,66,4],[47,2,47,4],[52,2,52,4],[54,2,54,4],[56,2,56,4],[58,2,58,4],[25,2,25,4],[31,2,31,4],[12,4,12,12],[20,1,20,4],[20,5,20,7],[20,8,20,9],[26,2,26,4],[15,4,15,12],[18,1,18,12],[19,1,19,11],[22,1,22,12],[3,4,3,12],[9,4,9,7],[9,8,9,10],[9,11,9,12],[6,4,6,7],[6,8,6,10],[6,11,6,12]]}
[null,null,"Hinweise"]
[null,"Price schedule",null,null,null,null,null,null,null,null,null,null,null,null,null,null,null,null,null,"Concluding the contract will hide the price schedule and allow you to fill in the list of costs."]
[]
[null,"Title of the measure:"]
[]
[]
[null,"Country:",null,null,"<Project country>",null,null,null,"Date:"]
[]
[]
[null,"Project/Programme no:",null,null,null,null,null,null,"Contract number:"]
[]
[]
[null,"Partner:",null,null,"<Name of private sector enterprise>",null,null,null,null,null,null,null,null,null,null,null,{"$f":"MAX($Q$22:$Q$65)","v":1}]
[]
[]
[null,"Währung:",null,null,"<Currency>",null,null,null,null,null,null,null,null,null,null,null,{"$f":"MAX($Q$22:$Q$65)","v":1}]
[]
[]
[null,"IMPORTANT: \n- Only prime costs are eligible for reimbursement in accordance with the percentage agreed in the contract\n- All items listed in the price schedule are stated as maximum values (amounts and costs per unit i.e. ‘up to’)\n=> PLEASE read the Guidelines on Eligible Costs in (i)DPPs",null,null,null,null,null,null,null,null,null,null,null,null,"Hilfsspalten, auszublenden"]
[null,"https://www.giz.de/en/downloads/giz2022-leitfaden-erstattungsfaehige-kosten-im-rahmen-von-iepw-en.pdf"]
[null,"Name \n",null,null,null,"Quantity / \nUnit ",null,null,"Costs \nof quantity / unit ",null,"Total costs \n","Partner Share \n","Share \nof GIZ ",null,"Autozeilenhöhe breit","Autozeilenhöhe schmal","Block","Block \nUnternehmen Gesamtkosten","Umbruch davor erlaubt"]
[]
[{"$f":"CHAR(Q23+64)","v":"@"},"<Name of enterprise>",null,null,null,null,null,null,null,null,null,null,null,null,null,null,{"$f":"COUNT(R$22:R22)","v":0},null,1]
[null,"Private enterprise’s experts (prime costs)"]
[null,"3.4.1","Daily rates / salaries for the private enterprise’s employees "]
[null,null,"<Name, function>",null,null,null,null,{"$f":"IF(G26=1,\"day\",\"days\")","v":"days"},"at",null,{"$f":"G26*J26","v":0},{"$f":"K26*AnteilFremd/100","v":0},{"$f":"K26-L26","v":0},null,null,{"$f":"C26","v":"<Name, function>"}]
[null,null,"<Name, function>",null,null,null,null,{"$f":"IF(G27=1,\"day\",\"days\")","v":"days"},"at",null,{"$f":"G27*J27","v":0},{"$f":"K27*AnteilFremd/100","v":0},{"$f":"K27-L27","v":0},null,null,{"$f":"C27","v":"<Name, function>"}]
[]
[null,null,"Sum daily rates / salaries",null,null,null,null,null,null,null,{"$f":"SUM(K25:K28)","v":0},{"$f":"SUM(L25:L28)","v":0},0]
[null,"3.4.3","Travel expenses (according to tax guidelines)",null,null,null,null,null,null,null,null,null,null,null,null,null,null,null,1]
[null,"a","Per diem allowances"]
[null,null,"<Country of assignment>",null,null,null,null,{"$f":"IF(G32=1,\"day\",\"days\")","v":"days"},"at",null,{"$f":"G32*J32","v":0},{"$f":"K32*AnteilFremd/100","v":0},{"$f":"K32-L32","v":0},null,null,{"$f":"C32","v":"<Country of assignment>"}]
[null,"b","Cost of overnight accommodation",null,null,null,null,null,null,null,null,null,null,null,null,null,null,null,1]
[null,null,"<Country of assignment>",null,null,null,null,{"$f":"IF(G34=1,\"night\",\"nights\")","v":"nights"},"at",null,{"$f":"G34*J34","v":0},{"$f":"K34*AnteilFremd/100","v":0},{"$f":"K34-L34","v":0},null,null,{"$f":"C34","v":"<Country of assignment>"}]
[null,"c","Travel expenses",null,null,null,null,null,null,null,null,null,null,null,null,null,null,null,1]
[null,null,"<Country of assignment>",null,null,null,"total",null,null,null,{"$f":"J36","v":0},{"$f":"K36*AnteilFremd/100","v":0},{"$f":"K36-L36","v":0},null,null,{"$f":"C36","v":"<Country of assignment>"}]
[null,"d","Flight costs (pref. Economy, Business Class poss. over 4hrs)",null,null,null,null,null,null,null,null,null,null,null,null,null,null,null,1]
[null,null,"<from – to>",null,null,null,null,{"$f":"IF(G38=1,\"flight\",\"flights\")","v":"flights"},"at",null,{"$f":"G38*J38","v":0},{"$f":"K38*AnteilFremd/100","v":0},{"$f":"K38-L38","v":0},null,null,{"$f":"C38","v":"<from – to>"}]
[]
[null,null,"Sum travel expenses",null,null,null,null,null,null,null,{"$f":"SUM(K30:K39)","v":0},0,0]
{"$rows_left_out":70}
{"sheet":"List of costs","index":2,"n_rows":118,"n_cols":39,"rows_kept":118,"cut":false,"hidden":true,"merged":[[19,1,19,12],[20,14,20,29],[21,26,21,27],[116,14,116,15],[116,17,116,21],[97,2,97,7],[98,2,98,7],[99,2,99,7],[109,14,109,21],[111,14,111,17],[111,18,111,21],[113,14,113,17],[113,18,113,21],[18,1,18,12],[96,2,96,7],[95,2,95,7],[78,2,78,4],[20,1,21,12],[35,2,35,4],[26,1,26,12],[29,2,29,4],[89,2,89,7],[80,2,80,4],[82,2,82,4],[71,2,71,4],[51,2,51,4],[56,2,56,4],[58,2,58,4],[90,2,90,7],[3,14,3,15],[24,1,24,4],[24,8,24,9],[3,4,3,12],[3,16,3,17],[6,4,6,12],[9,4,9,7],[9,11,9,12],[9,8,9,10],[12,4,12,10],[24,5,24,7],[6,14,6,15],[6,16,6,17],[12,11,12,12],[12,14,12,17],[15,4,15,10],[20,31,20,32],[21,14,21,15],[21,16,21,17],[21,18,21,19],[21,20,21,21],[21,22,21,23],[21,28,21,29],[21,31,21,32],[21,24,21,25],[22,31,23,32],[37,2,37,4],[39,2,39,4],[41,2,41,4],[76,2,76,4],[70,2,70,4],[30,2,30,4],[60,2,60,4],[62,2,62,4],[47,1,47,12],[50,2,50,4]]}
[]
[null,"List of costs for:",null,null,null,null,null,null,null,null,null,null,null,null,"The price schedule may be changed as a result of a supplement to the contract. "]
[]
[null,"Measure title:",null,null,{"$f":"'Price schedule'!E4","v":0},null,null,null,null,null,null,null,null,null,"Date: "]
[]
[]
[null,"Country:",null,null,{"$f":"'Price schedule'!E7","v":"<Project country>"},null,null,null,null,null,null,null,null,null,"Programme/Project term:   "]
[]
[]
[null,"Project/Programme no:",null,null,{"$f":"'Price schedule'!E10","v":0},null,null,null,"Contract number:  ",null,null,{"$f":"'Price schedule'!Vertragsnummer","v":0}]
[]
[]
[null,"Partner:",null,null,{"$f":"'Price schedule'!E13","v":"<Name of private sector enterprise>"},null,null,null,null,null,null,"Contact:",null,null,"<Person responsible for the list of costs>",null,null,null,null,null,null,null,null,null,null,null,null,null,null,null,null,null,null,null,null,null,{"$f":"MAX($AK$26:$AK$69)","v":1}]
[]
[]
[null,"Währung:",null,null,{"$f":"'Price schedule'!E16","v":"<Currency>"},null,null,null,null,null,null,null,null,null,null,null,null,null,null,null,null,null,null,null,null,null,null,null,null,null,null,null,null,null,null,null,{"$f":"MAX($AK$26:$AK$69)","v":1}]
[]
[]
[null,"IMPORTANT: \n- Only prime costs are eligible for reimbursement in accordance with the percentage agreed in the contract\n- All items listed in the price schedule are stated as maximum values (amounts and costs per unit i.e. ‘up to’)\n=> PLEASE read the Guidelines on Eligible Costs in (i)DPPs",null,null,null,null,null,null,null,null,null,null,null,null,null,null,null,null,null,null,null,null,null,null,null,null,null,null,null,null,null,null,null,null,"Hilfsspalten, auszublenden"]
[null,"https://www.giz.de/en/downloads/giz2022-leitfaden-erstattungsfaehige-kosten-im-rahmen-von-iepw-en.pdf"]
[null,"Figures from Price schedule\nTARGET costs",null,null,null,null,null,null,null,null,null,null,null,null,"List of costs by reporting period – ACTUAL costs",null,null,null,null,null,null,null,null,null,null,null,null,null,null,null,null,"RESIDUAL (TARGET costs minus ACTUAL costst)"]
[null,null,null,null,null,null,null,null,null,null,null,null,null,null,"1st reporting period",null,"2nd reporting period",null,"3rd reporting period",null,"4th reporting period",null,"5th reporting period",null,"6th reporting period",null,"7th reporting period",null,"8th reporting period",null,null,"Remaining residual funds"]
[null,null,null,null,null,null,null,null,null,null,null,null,null,null,"from:",null,"from:",{"$f":"IF(AND(P24<>\"\",R24<>\"\"),IF(ISNUMBER(P24),DATE(YEAR(P24),MONTH(P24)+1,1),\"\"),\"\")","v":""},"from:",{"$f":"IF(AND(R24<>\"\",T24<>\"\"),IF(ISNUMBER(R24),DATE(YEAR(R24),MONTH(R24)+1,1),\"\"),\"\")","v":""},"from:",{"$f":"IF(AND(T24<>\"\",V24<>\"\"),IF(ISNUMBER(T24),DATE(YEAR(T24),MONTH(T24)+1,1),\"\"),\"\")","v":""},"from:",{"$f":"IF(AND(V24<>\"\",X24<>\"\"),IF(ISNUMBER(V24),DATE(YEAR(V24),MONTH(V24)+1,1),\"\"),\"\")","v":""},"from:",{"$f":"IF(AND(X24<>\"\",Z24<>\"\"),IF(ISNUMBER(X24),DATE(YEAR(X24),MONTH(X24)+1,1),\"\"),\"\")","v":""},"from:",{"$f":"IF(AND(Z24<>\"\",AB24<>\"\"),IF(ISNUMBER(Z24),DATE(YEAR(Z24),MONTH(Z24)+1,1),\"\"),\"\")","v":""},"from:",{"$f":"IF(AND(X24<>\"\",AD24<>\"\"),IF(ISNUMBER(X24),DATE(YEAR(X24),MONTH(X24)+1,1),\"\"),\"\")","v":""},null,"(at the end of the overall reporting period)"]
[null,null,null,null,null,null,null,null,null,null,null,null,null,null,"to:",null,"to:",null,"to:",null,"to:",null,"to:",null,"to:",null,"to:",null,"to:",null,null,null,null,null,{"$f":"IF(AD24=\"\",IF(AB24=\"\",Z24,AB24),AD24)","v":0}]
[null,"Name \n",null,null,null,"Quantity /  \nUnit ",null,null,"Costs \nof quantity /  unit ",null,"Total costs \n","Partner \nshare ","Share \nof GIZ  ",null,"Actual \ncosts ","Share \nof GIZ ","Actual \ncosts ","Share \nof GIZ ","Actual \ncosts ","Share \nof GIZ ","Actual \ncosts ","Share \nof GIZ ","Actual \ncosts ","Share \nof GIZ ","Actual \ncosts ","Share \nof GIZ ","Actual \ncosts ","Share \nof GIZ ","Actual \ncosts ","Share \nof GIZ ",null,"Total \n ","Share \nof GIZ ",null,"Autozeilenhöhe breit","Autozeilenhöhe schmal","Block","Block \nUnternehmen Gesamtkosten","Umbruch davor erlaubt"]
[]
[{"$f":"CHAR(AK27+64)","v":"@"},{"$f":"'Price schedule'!B23","v":"<Name of enterprise>"},null,null,null,null,null,null,null,null,null,null,null,null,null,null,null,null,null,null,null,null,null,null,null,null,null,null,null,null,null,null,null,null,null,null,{"$f":"COUNT(AL$26:AL26)","v":0},null,1]
[null,"Private enterprise’s experts (prime costs)"]
[null,"3.4.1","Daily rates / salaries for the private enterprise’s employees "]
[null,null,{"$f":"'Price schedule'!C26","v":"<Name, function>"},null,null,null,{"$f":"'Price schedule'!G26","v":0},{"$f":"IF(G30=1,\"day\",\"days\")","v":"days"},"at",{"$f":"'Price schedule'!J26","v":0},{"$f":"G30*J30","v":0},{"$f":"K30*AnteilFremd/100","v":0},{"$f":"K30-L30","v":0},null,null,{"$f":"O30*AnteilGIZ/100","v":0},null,{"$f":"Q30*AnteilGIZ/100","v":0},null,{"$f":"S30*AnteilGIZ/100","v":0},null,{"$f":"U30*AnteilGIZ/100","v":0},null,{"$f":"W30*AnteilGIZ/100","v":0},null,{"$f":"Y30*AnteilGIZ/100","v":0},null,{"$f":"AA30*AnteilGIZ/100","v":0},null,{"$f":"AC30*AnteilGIZ/100","v":0},null,{"$f":"K30-O30-Q30-S30-U30-W30-Y30-AA30-AC30","v":0},{"$f":"M30-P30-R30-T30-V30-X30-Z30-AB30-AD30","v":0},null,null,{"$f":"C30","v":"<Name, function>"}]
[null,null,{"$f":"'Price schedule'!C27","v":"<Name, function>"},null,null,null,{"$f":"'Price schedule'!G27","v":0},{"$f":"IF(G31=1,\"day\",\"days\")","v":"days"},"at",{"$f":"'Price schedule'!J27","v":0},{"$f":"G31*J31","v":0},{"$f":"K31*AnteilFremd/100","v":0},{"$f":"K31-L31","v":0},null,null,{"$f":"O31*AnteilGIZ/100","v":0},null,{"$f":"Q31*AnteilGIZ/100","v":0},null,{"$f":"S31*AnteilGIZ/100","v":0},null,{"$f":"U31*AnteilGIZ/100","v":0},null,{"$f":"W31*AnteilGIZ/100","v":0},null,{"$f":"Y31*AnteilGIZ/100","v":0},null,{"$f":"AA31*AnteilGIZ/100","v":0},null,{"$f":"AC31*AnteilGIZ/100","v":0},null,{"$f":"K31-O31-Q31-S31-U31-W31-Y31-AA31-AC31","v":0},{"$f":"M31-P31-R31-T31-V31-X31-Z31-AB31-AD31","v":0},null,null,{"$f":"C31","v":"<Name, function>"}]
[]
[null,null,"Sum daily rates / salaries",null,null,null,null,null,null,null,{"$f":"SUM(K29:K32)","v":0},0,0,null,{"$f":"SUM(O29:O32)","v":0},0,0,0,0,0,0,0,0,0,0,0,0,0,0,0,null,{"$f":"SUM(AF29:AF32)","v":0},0]
[null,"3.4.3","Travel expenses (according to tax guidelines)",null,null,null,null,null,null,null,null,null,null,null,null,null,null,null,null,null,null,null,null,null,null,null,null,null,null,null,null,null,null,null,null,null,null,null,1]
[null,"a","Per diem allowances"]
[null,null,{"$f":"'Price schedule'!C32","v":"<Country of assignment>"},null,null,null,{"$f":"'Price schedule'!G32","v":0},{"$f":"IF(G36=1,\"day\",\"days\")","v":"days"},"at",{"$f":"'Price schedule'!J32","v":0},{"$f":"G36*J36","v":0},{"$f":"K36*AnteilFremd/100","v":0},{"$f":"K36-L36","v":0},null,null,{"$f":"O36*AnteilGIZ/100","v":0},null,{"$f":"Q36*AnteilGIZ/100","v":0},null,{"$f":"S36*AnteilGIZ/100","v":0},null,{"$f":"U36*AnteilGIZ/100","v":0},null,{"$f":"W36*AnteilGIZ/100","v":0},null,{"$f":"Y36*AnteilGIZ/100","v":0},null,{"$f":"AA36*AnteilGIZ/100","v":0},null,{"$f":"AC36*AnteilGIZ/100","v":0},null,{"$f":"K36-O36-Q36-S36-U36-W36-Y36-AA36-AC36","v":0},{"$f":"M36-P36-R36-T36-V36-X36-Z36-AB36-AD36","v":0},null,null,{"$f":"C36","v":"<Country of assignment>"}]
[null,"b","Cost of overnight accommodation",null,null,null,null,null,null,null,null,null,null,null,null,null,null,null,null,null,null,null,null,null,null,null,null,null,null,null,null,null,null,null,null,null,null,null,1]
[null,null,{"$f":"'Price schedule'!C34","v":"<Country of assignment>"},null,null,null,{"$f":"'Price schedule'!G34","v":0},{"$f":"IF(G38=1,\"night\",\"nights\")","v":"nights"},"at",{"$f":"'Price schedule'!J34","v":0},{"$f":"G38*J38","v":0},{"$f":"K38*AnteilFremd/100","v":0},{"$f":"K38-L38","v":0},null,null,{"$f":"O38*AnteilGIZ/100","v":0},null,{"$f":"Q38*AnteilGIZ/100","v":0},null,{"$f":"S38*AnteilGIZ/100","v":0},null,{"$f":"U38*AnteilGIZ/100","v":0},null,{"$f":"W38*AnteilGIZ/100","v":0},null,{"$f":"Y38*AnteilGIZ/100","v":0},null,{"$f":"AA38*AnteilGIZ/100","v":0},null,{"$f":"AC38*AnteilGIZ/100","v":0},null,{"$f":"K38-O38-Q38-S38-U38-W38-Y38-AA38-AC38","v":0},{"$f":"M38-P38-R38-T38-V38-X38-Z38-AB38-AD38","v":0},null,null,{"$f":"C38","v":"<Country of assignment>"}]
[null,"c","Travel expenses",null,null,null,null,null,null,null,null,null,null,null,null,null,null,null,null,null,null,null,null,null,null,null,null,null,null,null,null,null,null,null,null,null,null,null,1]
[null,null,{"$f":"'Price schedule'!C36","v":"<Country of assignment>"},null,null,null,"total",null,null,{"$f":"'Price schedule'!J36","v":0},{"$f":"J40","v":0},{"$f":"K40*AnteilFremd/100","v":0},{"$f":"K40-L40","v":0},null,null,{"$f":"O40*AnteilGIZ/100","v":0},null,{"$f":"Q40*AnteilGIZ/100","v":0},null,{"$f":"S40*AnteilGIZ/100","v":0},null,{"$f":"U40*AnteilGIZ/100","v":0},null,{"$f":"W40*AnteilGIZ/100","v":0},null,{"$f":"Y40*AnteilGIZ/100","v":0},null,{"$f":"AA40*AnteilGIZ/100","v":0},null,{"$f":"AC40*AnteilGIZ/100","v":0},null,{"$f":"K40-O40-Q40-S40-U40-W40-Y40-AA40-AC40","v":0},{"$f":"M40-P40-R40-T40-V40-X40-Z40-AB40-AD40","v":0},null,null,{"$f":"C40","v":"<Country of assignment>"}]
{"$rows_left_out":79}
{"sheet":"Notes","index":3,"n_rows":32,"n_cols":3,"rows_kept":32,"cut":false,"hidden":false,"merged":[]}
[]
[]
[]
[]
[]
[null,null,"Note on general use of this document"]
[null,null,"v.2"]
[]
[null,null,"Important note on the macros in this file:"]
[null,null,"To make possible the addition and deletion of lines and blocks, completion of the price schedule and the generation of a contract supplement, the macros in this document must be retained and be activated after opening."]
[null,null,"1. If the file is saved manually, always select \"Excel worksheet with macros (*.xlsm) as file type. "]
[null,null,"2. After opening the file, select 'Enable content' in the warning message (yellow bar at the top edge)."]
[]
[null,null,"The following instructions apply for the functions in the price schedule:"]
[null,null,"- Insert new lines below the highlighted cell."]
[null,null,"- Always insert a new below (before the external experts)."]
[null,null,"- The highlighted line or block is always deleted."]
[null,null,"- One line must be retained for each type of entry line."]
[]
[null,null,"'Prepare for print' automatically sets the print layout and inserts the entered contract number in the footer."]
[]
[null,null,"Note on Excel bug which can arise in this file"]
[null,null,"It is possible that individual cells may not be automatically calculated despite containing the correct formula. If the file macros are activated, recalculation of all cells is forced after opening and before printing. In addition, the button provided for this purpose in the worksheets can be clicked."]
[]
[null,null,"Notes on the price schedule:"]
[null,"1.","Only prime costs are eligible for reimbursement in accordance with the percentage agreed in the contract."]
[null,"2.","All items listed in the price schedule are stated as maximum values \n(amounts and costs per unit i.e. ‘up to’)."]
[null,null,"=> PLEASE read the Guidelines on Eligible Costs in (i)DPPs"]
[]
[null,null,"Notes on the statement of costs:"]
[null,"1.","For the PPP contribution, all amounts shown are regarded as maximum values (i.e. 'up to')."]
[null,"2.","Deviations in an individual budget item can be offset against other budget items up to a total of 10% of the respective item. Deviations beyond this require prior agreement by GIZ."]